{"text_format":"1","workbook":"xlsx","n_sheets":2,"sheets":["Tabell","Rapport"],"not_rendered":{"charts":0,"images":8,"macros":1,"external_links":0,"defined_names":2,"comments":0,"pivot_tables":0},"unopened":[],"bounds":{"document_bytes":16777216,"sheet_cells":100000,"rows_first":2000,"rows_last":500,"rows_between":2000,"halvings":0,"cell_chars":16384,"cell_head_chars":4096},"cells_cut":0,"cells_raw":0,"read":"whole","date_system":"1900"}

{"sheet":"Tabell","index":0,"n_rows":79,"n_cols":21,"rows_kept":79,"cut":false,"hidden":false,"merged":[]}
[null,null,null,null,null,null,"Dölj","Dölj","Dölj","Dölj","Dölj","Dölj","Dölj","Dölj","Dölj","Dölj",null,null,null,"Dölj","Dölj"]
[]
[]
[null,null,null,null,null,null,null,null,null,null,null,null,null,null,null,null,null,"Finansiärer och idéskapare:"]
[]
[null,null,null,null,null,"databas över provvägar"]
[]
[]
[]
["Id","Ämnesområde","Material","Lager","Beläggningstyp","År","Finansiär","Provsträckor","Län",null,"Syfte","Bakgrund","Sammanfattning","Uppbyggnad","Utförda tester","Slutsatser","Författare","Titel","Referens","Övriga källor","Uppgiftslämnare"]
[1,"Återvinning, halvvarm","Asfalt","Bärlager","MJOG/MJAG",2013,"Trafikverket","Väg 395, Kaunisvaara och Svappavaara","Norrbotten","BD","I samband med att vägen mellan Kaunisvaara och Svappavaara behövde rustas upp, eftersom man förväntar sig kraftigt ökande malmtransporter av mycket tunga gruvfordon (90 ton) framöver, planerades fyra provsträckor med olika halter av gamla asfaltbeläggningar.","Längs vägen, med omfattande malmtransporter framöver, mellan Kaunisvaara och Svappavaara ligger idag gamla MJOG- och MJAG-beläggningar. I och med att denna väg (samt många sträckor längs E10 och E12) kräver varma beläggningar i samband med den förväntade ökningen av tunga malmtransporter, finns ett behov av att undersöka i vilken omfattning som dessa halvvarma massor går att återvinna i varmt tillverkad asfalt. Fyra provsträckor har utförts. En sträcka med AG22 160/220 (referens) och 3 sträckor med 10%, 20% och 30% granulatinblandning. (referens) och 3 sträckor med 10%, 20% och 30% granulatinblandning. Försökssträckorna med inblandning av halvvarma massor i varma  massor har utförts inom etapp 2 Merasjärvi–Vittangi, där utläggning av understa AG lagret utfördes vecka 41 2013. Övriga delar utfördes våren 2014. ","Syftet med denna undersökning var att se i vilken grad man kan blanda in gamla asfaltbeläggningar som granulat i nytillverkad varmasfalt utan att försämra egenskaperna hos den nya beläggningen. Vägen mellan Kaunisvaara och Svappavaara behövde rustas upp på grund av kraftigt ökande malmtransporter med mycket tunga fordon (90 ton) framöver. För att se om den gamla beläggningen kunde användas som granulat i nytillverkad varmasfalt planerades fyra provsträckor med olika halter av gamla asfaltbeläggningar. De alternativ som testats är 0 procent inblandning (referensmassa) samt 10, 20 och 30 procent granulatinblandning. Asfaltmassa från dessa fyra provsträckor har skickats till VTI för analys. Förutom grundläggande data av bindemedelshalt och kornkurva har bindemedelsegenskaper på återvunnet bitumen utförts (penetration och mjukpunkt) samt bestämning av hålrumshalt och styvhetsmodul vid +10 °C på borrkärnor från laboratorietillverkade plattor. Resultaten visar att materialet från provsträckorna med granulat är likvärdiga med referensmassan avseende styvhetmodul vid +10 °C. Undersökningen indikerar därmed att tekniken med att blanda återvunnen mjukasfalt i varmasfalt fungerat väl i halter upp till 30 procent. Vägen bör följas upp framöver för att studera eventuella skillnader mellan de olika provsträckorna över tiden med beaktande av hur omfattande den tunga trafiken kommer att vara längs denna vägsträcka."," Fyra provsträckor har utförts. En sträcka med AG22 160/220 (referens) och 3 sträckor med 10%, 20% och 30% granulatinblandning. (referens) och 3 sträckor med 10%, 20% och 30% granulatinblandning.  Konstruktionen för hela sträckan längs väg 395 består av två lager AG22, bindlager och slitlager av  ABT. Totalt 200 mm tjock beläggning som kommer att trafikeras av mycket tunga gruvfordon (90 ton). Vägens bredd blir 8 meter. Försökssträckorna med inblandning av halvvarma massor i varma  massor har utförts inom etapp 2 Merasjärvi–Vittangi, där utläggning av understa AG lagret utfördes vecka 41 2013. Övriga delar utfördes våren 2014.  idag gamla MJOG- och MJAG-beläggningar. ","Nu utförs laboratorieförsök på asfaltmassor från fyra olika provsträckor där granulat blandats in i nytillverkad varmasfalt i halterna 0, 10, 20 och 30 %. Analyserna utförs både på asfaltmassan och på borrkärnor från laboratorietillverkade plattor. ","Undersökningen avser asfaltsmassor från fyra provsträckor med AG 16 160/220, där granulat från\nåtervunnen mjukasfalt (MJOG/MJAG) blandats in med halterna 0, 10, 20 och 30 %. De analyser som\nhar utförts är bindemedelshalt, kornkurva och bitumenanalyser på återvunnet bitumen samt\nstyvhetsmodul vid +10 °C. Inga avvikande resultat jämfört med recepten har noterats, mer än att\nbituminet, som väntat, hårdnat betydligt på alla 4 provsträckorna. Styvhetsmodulen för borrkärnor från\nlaboratoriepackade plattor ligger strax över 5 000 MPa vilket är lågt för denna beläggningstyp med\ntanke på att vägen är högtrafikerad av gruvfordon, men ingen skillnad mellan referens och övriga\nprovsträckor har noterats. Resultaten visar att materialet från provsträckorna med granulat är likvärdiga med referensmassan avseende styvhetmodul vid +10 °C. Således indikerar denna undersökning att tekniken med att blanda återvunnen mjukasfalt i varmasfalt fungerat väl i halter upp till 30 %. \n\nFör vidare uppföljning av dessa provsträckor är det intressant att se om de olika halterna\ngranulatinblandning påverkar beständigheten.","Leif Viman et al.","Återvinning av MJOG/MJAG i varmblandad asfalt (halvvarmt i varmt)","VTI notat 18-2015",null,"Leif Viman, VTI"]
[2,"Energisnåla beläggningar","Kalltillverkad asfalt","Bärlager","ABTs8/AG22",2012,"SBUF/TRV/NCC","Björlanda, Lexbyvägen i Göteborg","Västra Götaland","O","Denna rapport undersöker och samlar in erfarenheter kring kalltillverkad asfalt. Rapporten syftar till att samla in erfarenheter av kalltillverkad asfalt, med en samlad uppmärksamhet på väsentliga faktorer för nedbrytningsprocessen.","Kall asfaltteknik har periodvis använts i Sverige under många år. Både kalltillverkade slit- och bärlagermassor har lagts på det lågtrafikerade vägnätet. Erfarenheterna har varit blandade men i de flesta fall positiva.","Fokus kommer att ligga på de koncept som har fungerat bäst och som är lämpliga för vidareutveckling. Rapporten beskriver också mix design och provningsmetoder för kvalitetskontroll, både i laboratoriemiljö och i fält. Tidigare erfarenheter av kalltillverkad asfalt visar att de problem som har uppmärksammats har uppkommit vid användande av emulsioner baserade på hårdare penetrationsbitumen. I dessa fall har det varit svårt att styra brytningshastigheten på emulsionen. Vissa beläggningar har i förtid fått en del beständighetsproblem eller plastiska deformationer. I de laboratorietester som genomförts har det visat sig att stenmaterial med lågt ASR-tal (alkalisilikareaktivt ballastmaterial) samt liten specifik yta på filler är lämpligt att använda vid tillverkning av kalla afaltmassor. Material med lågt ASR-tal medför också att vi med all sannolikhet kan täta till dom kalla massorna och sänka hålrumshalten, det är dock viktigt att hålrummen ligger mellan 8-12% för att vattnet i emulsionerna snabbt skall forslas bort från beläggningen. Detta är en helt ny upptäckt och bör undersökas vidare. Rapporten visar också på de positiva effekter för miljön som en kalltillverkad massa har. Efter genomförd livscykelanalys på varm - respektive kalltillverkad asfaltmassa observerades en betydligt mindre miljöpåverkan i form av lägre CO2 utsläpp och lägre energiförbrukning för den kalltillverkade massan. Beräkningarna i livscykelanalysen är från bitumenkälla till färdig väg inklusive transporter, krossning och insatsvaror. I projektet gjordes också ett fullskaleförsök där en varmtillverkad AG22-massa jämförs med en kalltillverkad AG22–massa, nedan kallad Base22. Bitumenkvalitet är 160/220 i båda fallen. Resultaten från detta visar att bindemedlets egenskaper förändra betydligt mindre vid kalltillverkning och att hålrummet i den kalla asfaltmassan är något högre. Styvhetsmoduler vid 10 och 20 grader Celsius är jämförbara för både kalltillverkning och varm tillverkning men vid 5 grader Celsius ökar inte styvheten lika mycket i den kalltillverkade asfaltmassan som den konventionella asfaltmassan. Även fallviktsmätning på den färdiga konstruktionen är likvärdig mellan dom båda beläggningarna. ","Bundna bär- och slitlager","Förprovning och laboratorietester på borrkärnor bl.a. dyn.kryp) samt fallviktsmätningar mm.","Under laboratoriearbetena som utfördes hos Pankas i Danmark kom det fram helt nya upptäckter angående stenmaterialets egenskaper i 0-4 delen, som så här långt verkar vara den faktor som bestämmer om emulsionen skall fungera mot stenmaterialet.\nAlkalisilikareaktivt ballastmaterial förkortat ASR är sedan länge känt inom betongbranschen men inte inom beläggningsbranschen. Ett ASR tal över 15 i ett 0-4 material innebär att man inte kan tillverka betong utan att det kommer att vittra sönder. Vår Laboratorieundresökningar visar att detsamma gäller för material som utsätts för emulgatorer. Dessa material har också stor specifik yta och har tendens att få stor svällning och viktförlust.\nMaterial med lågt ASR-tal medför också att vi med all sannolikhet kan täta till dom kalla massorna och sänka hålrumshalten, det är dock viktigt att hålrummen ligger mellan 8-12% för att vattnet i emulsionerna snabbt skall forslas bort från beläggningen.\nGamla provvägar som redovisas i detta projekt har fungerat utan underhållsåtgärder i 15 år och kommer att leva många år till. Det som skall noteras angående dessa vägar är att stenmaterialet som är använts har ett ASR-tal på noll, vilket styrker vår teori att angående Alkalisilika bergarter.","Roger Lundberg","Energisnåla asfaltbeläggningar – kalltillverkad asfalt. Etapp 1","SBUF 12702 Rapport 2014-01-29","","Leif Viman, VTI"]
[3,"Totalentreprenad","Asfalt","Överbyggnad","Flera",2010,"SBUF/TRV/NCC/Nynas","Väg 50 Mjölby-Motala","Östergötland","E","Det övergripande syftet med detta projekt är att kvantifiera effekten av polymermodifierade beläggningslager i termer av storheterna ojämnhet i tvärled (spårdjup) och IRI (International Roughness Index) jämfört med motsvarande standardbeläggningar, baserat på en längre tids uppföljning av fältförsök. Syftet motiveras av följande: • Generellt saknas verktyg för att kvantifiera vägytans utveckling över tid. • Polymermodifiering av bindemedel förbättrar i regel beläggningensegenskaper i termer av spårdjup och IRI. Provschemat är utformat för att kvantifiera denna hypotes.","Den traditionella utförandeentreprenaden kan kontrasteras mot senare och mer eller mindre frekventa entreprenadformer som använts av olika beställare under 1900-talet och början på 2000-talet. Sådana okonventionella entreprenadformer, varav totalentreprenaden kanske är den mest kända, kännetecknas framförallt av att åtagandet innebär att entreprenören kontrakteras till fler aktiviteter än ren produktion. Exempelvis innebär totalentreprenaden normalt att projektering, inklusive dimensionering av vägkroppen ingår i entreprenörens åtagande. I vissa fall kan även drift- och underhållsåtagande omfattas av avtalet. Figur 1 illustrerar de huvudsakliga skillnaderna mellan utförande- och totalentreprenader rörande aktiviteter kontrakterade mellan beställare och entreprenör.","I och med den ökande andelen totalentreprenader är det i ökande grad viktigt för entreprenörer och Trafikverket att mer i detalj följa enskilda objekt för att i framtida entreprenader dels minska graden av tekniska osäkerheter och risker och dels undersöka hur dessa omständigheter kan motverkas med nya material och utförandemetoder. I NCC:s entreprenad väg 50 Mjölby-Motala, har det utförts provsträckor för att studera effekten på vägytans jämnhet av att använda högpresterande bitumen i jämförelse med de beläggningar som utförts i övrigt påentreprenad, vilka utförs med normalt penetrationsbitumen. Försöksplaneringen baseras på 3 faktorer (de olika beläggningslagren: slit-,bind- och bärlager) och varje lager (faktor) förekommer i 2 olika varianter (standardbindemedel resp. högpresterande bindemedel), vilket ger sammanlagt 8 kombinationer (23). Beläggningsarbetet förlöpte mycket väl och inga avvikelser som på något känt sätt kan påverka framtida analys noterades.","Ett 10-tal provsträckor med modifierat bitumen i de olika lagren slit-, bind och bärlager.","Huvudsakligen mäts vägens jämnhet, men även styvhet, deformation, utmattning och nötningsegenskaper kommer att udersökas.","Generellt förlöpte utförandet av provsträckorna mycket väl utan några egentliga\nmissöden. En allmän önskan var att produktionen skulle ske under normala\nförhållanden, inga hänsyn, utöver mer noggrann kontroll av logistik, skulle tas.\nDetta för att få en bild av vad som kan åstadkommas med förändrat bindemedel\nunder normal produktion. Denna inriktning återspeglas även i val av\nhögpresterande bindemedel: det skulle vara tillgängligt på marknaden och därmed\ninte alltför exotisk.\nVägen funktion kommer att mätas årligen, höst och vår, under hela försökstiden\nsom initialt omfattar 5 år. Övrig provning sker vid byggandet.","Jonas Ekblad och Robert Lundström","Slutrapport Provväg Skänninge Del 1 Planering och utförande, Del 2 Inledande mätningar, material och vägyta","NCC Rapport 2014-01 (SBUF 12760) ","NCC Rapport 2014-02 (SBUF 12760) ","Jonas Ekblad, NCC"]
[4,"Bindemedelsegenskaper","Bitumen","Slitlager","ABS",2008,"SBUF/Vägverket","Rv 49 mellan Mariesjö-Ingelstorp","Skåne","M","Att jämföra nya bindemedel med olika härkomst. Denna gång har både bindemedlets och den färdiga asfaltmassans egenskaper utvärderas till fullo med en mängd metoder och inte bara de som ingår i aktuella kravspecifikationer. Genom att isolera inverkan från skillnader i asfaltmassans sammansättning och provberedningen skall tydliga slutsatser kring bindemedlets inverkan kunna dras.","Den nya bitumenspecifikationerna EN 12591:2009 som börjar gälla 2010 innebär att nya bitumen (bindemedlet i asfalt) kan dyka upp på den svenska marknaden. För svensk del innebär det att kravnivån på dynamisk viskositet vid 60°C sänks eftersom vi tidigare haft ett undantag genom den sk A-deviationen. En förstudie som gjordes av Vägverket 2006-2007 på bitumen av sorten 160/220 antydde stora skillnader mellan hur bitumen av olika härkomst påverkade de funktionella egenskaperna på den färdigtillverkade asfaltmassan, även om alla de testade produkterna föll inom ramarna för den kommande EN-specifikationen. För att fortsätta utreda vilken inverkan bindemedel av olika härkomst har på asfaltens egenskaper startades detta samfinansierade fullskaleprojekt mellan branschens företag och Vägverket.","Från och med 2010 kommer Sverige att helt anpassa sig till den nya harmoniserade Europeiska bitumenspecifikationen (EN12591:2009). Sveriges strängare krav för dynamisk viskositet vid 60 °C, genom den sk A-deviationen försvinner och förändringen kommer förmodligen att innebära ett ökat utbud av bitumen där råoljan har varierande ursprung. För att undersöka effekten av förändringen initierade Vägverket detta projekt 2008 där 7 olika bitumenleverantörer fick möjlighet att deltaga i ett fullskaleförsök där bitumen 70/100 upphandlades enligt den nya Europaspecifikationen för penetrationsbitumen. Två av dessa bitumen klarade inte den tidigare svenska specifikationen. Av vardera bitumentyp tillverkades ca 500 ton asfaltmassa som lades ut på Rv 49 mellan Mariesjö-Ingelstorp. Vid tillverkningen uttogs bindemedelsprover och massaprover för jämförande laboratorieundersökningar där de flesta av branschens aktörer medverkade. Även borrprover från vägen har analyserats. De båda bitumen som låg utanför den svenska specifikationen uppvisar de bästa deformationsegenskaperna både med wheeltrack vid 50 ºC och dynamisk kryptest vid 40 ºC. Dessa båda bitumen tillhör också den grupp som har de högsta styvhetsmodulerna. I projektet konstaterades att återuppvärmningen av asfaltmassa i värmeskåp före tillverkning av plattor gav ett kraftigt hårdnande av bitumen och där de olika bitumentyperna reagerade olika. Analyser enligt ITSR på asfaltmassan visar inte på några skillnader mellan de olika bitumentyperna även efter det att provkropparna utsatts för frys/tö konditionering. Inte heller nötningsegenskaperna skiljer sig åt mellan de olika bitumentyperna. Den metod som särskiljer de olika bitumentyperna mest åt är rullflasketestet. Den utprovade kvartsiten har dokumenterat goda nötningsegenskaper men ytan är mycket slät och inget av bindemedlen klarade 24 h-testet utan vidhäftningsmedel. Vid tillsatt cement så klarade sig två bitumen klart bättre än övriga. ","ABS 16 med 7 olika bitumenkvaliteter","Bitumenanalyser och Slitage i vändskak, Hamburger Wheel track, Dynamisk krypstabilitet, Styvhetsmodul, Vattenkänslighet (ITSR), Vidhäftning enligt rullflaskmetoden, Slitage enligt Prall och Lågtemperaturegenskaper enligt TSRST","styvhetsmodul vid +10 °C. Inga avvikande resultat jämfört med recepten har noterats, mer än att","Kenneth Olsson, Niclas Krona (Skanska), Torsten Nordgren (Vägverket)","Asfaltbeläggningar med bindemedel av olika ursprung","SBUF 12091","","Leif Viman, VTI"]
[5,"Gummiasfalt","Asfalt","Slitlager","GAP",2007,"Vägverket","1.Rv 32 -Eksjö 5,5 km, Jönköping, 2.E6 Yttre ringvägen Malmö/Tpl Sallerup-tpl Fred 4,5 km, Skåne\n3.E6 Betongväg Malmö-Vellinge (0,6 km) ,4.Tygelsjö, Skåne, Väg 1137 Ådalsvägen, Löddeköpinge (0,7 km), Skåne\n5.Rv 9 Ystad-Sandskogen (2,9 km), Skåne, 6.E6 Vellinge-Petersborg (6,2 km), Skåne\n7.E6 Fredriksberg-Sunnanå (6,7 km), Skåne, 8.Rv 31 Vetlanda (4,0 km), Jönköping\n9.Väg 262 Edsberg-Danderyd (6,0 km), Stockholm, 10.E18 Järva krog-Bergshamra, Stockholm\n11.E22 Norrköping (1,5 km), Östergötland, 12.Väg 180 Alingsås, Västra Götaland\n13.E6/E20 Ullevimotet-Ånäsmotet, Göteborg, Västra Götaland","Jönköping","F","Att utreda nyttan med gummiasfalt samt se om det finns några hinder för att introducera tekniken i Sverige. I USA har man använt gummiasfalt i 25 år och tekniken håller nu på att spridas över världen. Gummiasfalt börjar bli vanlig på flera håll, till exempel i Kanada, Brasilien, Kina, Australien, Sydafrika och delar av Europa. Gummiasfalten förväntas ha betydligt längre livslängd än traditionell asfalt, vilket är bra för både miljö och ekonomi. Med färre åtgärder sparas både pengar och utsläpp. Gummiasfalten har också egenskaper som gör det möjligt att minska det buller som uppstår av trafiken. ","Trafikverket inledde ett projekt under 2006 för att utvärdera gummiasfaltbeläggningar för svenska förhållanden. Erfarenheterna har hämtats från Arizona, USA, där gummiasfalt är en väl utprövad beläggningstyp. En specifikation för gummibitumen/asfalt har tagits fram av Arizona Department of Transportation (ADOT). Under 2006 gjordes en förstudie som främst handlade om att studera miljöeffekter och erfarenheter från USA och under 2007 testades gummiasfalt på ett antal sträckor i Småland och Skåne och har sedan utökats med provsträckor i Stockholm och Göteborgsområdet. På väg 32 utanför Eksjö i Småland lades en provsträcka på cirka tio kilometer. Ungefär halva sträckan utfördes med gummiasfalt och resterande med traditionell asfalt. Detta för att kunna jämföra bland annat slitage och beständighet. I Skåne lades flera sträckor. På en mindre väg i Löddeköpinge (Lund) testades det öppna konceptet på en kort sträcka. Utanför Malmö lades gummiasfalt på en sträcka av E6, där cementbundna bärlager inneburit att slitlagren spruckit pga. de spänningar som uppstår i cementlagret vid temperaturväxlingar.","Trafikverket har under 2007-2009 utfört ett 15-tal beläggningsobjekt med gummiasfalt på olika platser i Sverige, främst i storstadsregionerna Stockholm, Göteborg och Malmö. De första sträckorna utfördes dock i Småland mellan Eksjö och Vetlanda. Tekniken med gummiasfalt har inhämtats från Arizona, USA, där man har lång erfarenhet av denna beläggningstyp, som bygger på återanvändning av gamla bildäck. Däcken mals ner till ett gummigranulat som blandas in i bitumen i ett särskilt blandningsverk som ansluts till ett asfaltverk. Man har haft flera syften eller förhoppningar vid införandet av denna beläggningstyp. Främst ökad livslängd, men även bullerdämpande effekter samt sprickreducerande förmåga vid beläggningar på cementstabiliserade lager. Dessutom har miljöaspekten varit en viktig fråga genom hela projektet, där erfarenheter från USA inhämtats men där det även utförts många kompletterande studier i Sverige, både vad gäller omgivande miljö och arbetsmiljö. Ingen av dessa miljöundersökningar visar på några påtagliga/allvarliga effekter i samband med gummiinblandning i asfaltbeläggning, varken avseende arbetsmiljö (utsläpp av giftiga ämnen, främst polycykliska aromatiska kolväten s.k. PAH) eller omgivningsmiljö (emissioner till luft och vatten). Resutaten visar att gummiasfalt inte innebär några ökade risker jämfört med konventionell beläggning så länge temperaturen hålls under ca +175 °C. När det gäller de tekniska egenskaperna har resultaten hittills visat att den ”våta blandningstekniken” fungerar väl enligt de vägytemätningar och laboratorietester som hittills utförts. De flesta objekten inom detta projekt har utförts med gummibeläggningar av GAP-typ (motsvarar i princip ABS). Svårigheter av olika slag uppstår alltid vid införande av nya tekniker. För konceptet med den öppna beläggningstypen GAÖ har både positiva och negativa resultat erhållits varför dennna beläggningstyp behöver utvecklas ytterligare för att erhålla en pålitlig beläggning med tillräcklig beständighet. Konceptet där gummibeläggning använts som slitlager på en betongkonstruktion för att reducera reflektionssprickor har givit mycket lovande resultat men här finns troligen potential att ytterligare förbättra detta koncept. ","Gummiasfalt som slitlager","I denna samlingsrapport finns referenser till alla undersökningar som gjorts i samband med införandet av gummiasfalt i Sverige från tekniska undersökningar till miljömässiga aspekter. ","bituminet, som väntat, hårdnat betydligt på alla 4 provsträckorna. Styvhetsmodulen för borrkärnor från","Leif Viman","Gummiasfaltbeläggning -Sammanställning av utförda mätningar och provningar","VTI utlåtande 752-2011","http:/www.trafikverket.se/gummiasfalt","Leif Viman, VTI"]
{"$rows_left_out":65}
{"sheet":"Rapport","index":1,"n_rows":95,"n_cols":10,"rows_kept":95,"cut":false,"hidden":false,"merged":[[1,5,1,9],[34,1,50,9],[91,3,91,9],[89,1,89,9],[62,1,68,9],[17,1,22,9],[7,6,7,7],[92,3,92,9],[3,8,3,9],[8,1,14,9],[5,3,5,4],[3,3,3,4],[4,3,4,4],[25,1,31,9],[53,1,59,9],[71,1,83,9]]}
[null,null,null,null,null,null,null,null,"Utskriftsdatum: ",{"$f":"TODAY()","v":"2017-01-18"}]
[null,"Provvägsid:",4,null,"Ämnesområde:",{"$f":"VLOOKUP(C2,Tabell!A10:U100,2)","v":"Bindemedelsegenskaper"}]
[]
[null,"Material:",null,{"$f":"VLOOKUP(C2,Tabell!A10:U100,3)","v":"Bitumen"},null,null,null,"Provvägens finansiär:",{"$f":"VLOOKUP(C2,Tabell!A10:U100,7)","v":"SBUF/Vägverket"}]
[null,"Beläggningslager:",null,{"$f":"VLOOKUP(C2,Tabell!A10:U100,4)","v":"Slitlager"}]
[null,"Beläggningstyp:",null,{"$f":"VLOOKUP(C2,Tabell!A10:U100,5)","v":"ABS"},null,null,null,"År:",{"$f":"VLOOKUP(C2,Tabell!A10:U100,6)","v":2008}]
[]
[null,"Provsträckor (geografisk placering mm):",null,null,null,"Län:",{"$f":"VLOOKUP(C2,Tabell!A10:U100,9)","v":"Skåne"},null,{"$f":"VLOOKUP(C2,Tabell!A10:U100,10)","v":"M"}]
[null,{"$f":"VLOOKUP(C2,Tabell!A10:U100,8)","v":"Rv 49 mellan Mariesjö-Ingelstorp"}]
[]
[]
[]
[]
[]
[]
{"$rows_left_out":80}